Minoranze
type: Concept
preferred label: minorias @pt-br
preferred label: grupos minoritarios @es
preferred label: Minorités @fr
preferred label: マイノリティー @ja-jp
preferred label: minority group @en-gb
preferred label: Minderheit @de
definition: Eine Gruppe von Menschen, die klassifiziert wird aufgrund ihrer Abstammung, Sprache, Religion oder anderer Merkmale, die weniger häufig sind als die der anderen aus der Gruppe. @de
definition: Grupo de pessoas classificadas por raça, língua, religião ou outras características, numericamente inferiores a outros da mesma classificação. @pt-pt
definition: Gruppi di persone classificati in base a razza, lingua, religione o altre caratteristiche, di numero inferiore rispetto ad altri gruppi
definition: Un grupo de personas clasificado por raza, lenguaje, religión u otras características, numeralmente menores que otros del la misma clasificación. @es
definition: Groupe de personnes identifiées par la race, la langue, la religion ou d'autres caractéristiques numériquement moins nombreux que d'autres dans le même ensemble @fr
definition: 同じ分類の他より数値的に少ない人種、言語、宗教または他の特徴によって分類されるグループ @ja-jp
definition: A group of people classified by race, language, religion or other characteristic numerically smaller than others of the same classification @en-gb
note: nessuno
in scheme: subjectcode
created: 2000-10-30T12:00:00+00:00
modified: 2010-12-15T17:01:09+00:00
broader: http://cv.iptc.org/newscodes/subjectcode/14000000
narrower: http://cv.iptc.org/newscodes/subjectcode/14010001
narrower: http://cv.iptc.org/newscodes/subjectcode/14010002