pornografia
type: Concept
preferred label: Pornografia @it
preferred label: pornography @en-gb
preferred label: Pornographie @fr
preferred label: ポルノ @ja-jp
preferred label: pornografía @es
preferred label: Pornografie @de
definition: Audio or visual depictions of various sex related acts considered outside accepted community standards @en-gb
definition: Production de livres, films, ou autres d'une obscénité à caractère sexuel hors des normes acceptées par la société @fr
definition: 認められたコミュニティ標準から外れたと考えられる性に関連する様々な行為の音声あるいは視覚的な描写 @ja-jp
definition: Representações em fotos, áudio ou vídeo de vários atos sexuais de forma explícita.
definition: representación auditiva o visual de varios actos relacionados al sexo, considerados fuera de los estándares aceptados por la comunidad. @es
definition: Akustische oder bildliche Darstellungen von verschiedenartigen im Zusammenhang mit Sexualität stehenden Taten, außerhalb der gesellschaftlich akzeptierten Normen. @de
definition: Produzione di libri, film o altro caratterizzati da argomenti di tipo sessuale considerati al di fuori degli standards @it
definition: Representações em áudio ou vídeo de vários atos sexuais considerados fora dos padrões aceitos por uma comunidade.
note: nessuno @it
in scheme: subjectcode
created: 2000-10-30T12:00:00+00:00
modified: 2010-12-15T17:01:09+00:00
broader: http://cv.iptc.org/newscodes/subjectcode/14000000