Prostituzione
type: Concept
preferred label: 売春 @ja-jp
preferred label: prostitución @es
preferred label: Prostitution @de
preferred label: prostituição @pt-br
preferred label: prostitution @en-gb
definition: Prêt de son corps aux désirs sexuels d'autrui contre rémunération et ceux qui en profite @fr
definition: Sex for sale, either male or female, and those who profit from it @en-gb
definition: 男性または女性に性を売り、それで利益を得る人々 @ja-jp
definition: Venta de sexo, ya sea masculino o femenino, y aquellos que se benefician de ello. @es
definition: Venda de sexo, masculino ou feminino, e aqueles que beneficiam dessa venda. @pt-pt
definition: Männliche oder weibliche Sexualität als Ware, und diejenigen, die davon profitieren. @de
definition: Prestazioni sessuali a pagamento
note: nessuno
in scheme: subjectcode
created: 2000-10-30T12:00:00+00:00
modified: 2010-12-15T17:01:09+00:00
broader: http://cv.iptc.org/newscodes/subjectcode/14000000