Welfare
type: Concept
preferred label: Sozialfürsorge @de
preferred label: assistência social @pt-pt
preferred label: welfare @en-gb
preferred label: Protection sociale @fr
preferred label: 福祉 @ja-jp
preferred label: asistencia social @es
definition: Aiuto pubblico garantito alle persone che ne hanno bisogno per il sostentamento in termini di cibo, alloggio, salute e altri servizi
definition: Ajuda do governo proporcionada às pessoas, sobretudo as mais desfavorecidas, que precisam de comida, habitação, saúde e outros serviços. @pt-pt
definition: Grundsätzliche Unterstützung von Menschen, seitens der Regierung, die Nahrungsmittel, Unterkunft, Gesundheit und andere Dienstleistungen benötigen. @de
definition: L'aide publique aux personnes, en particulier les plus défavorisées @fr
definition: Generally government help for those in need of food, housing health and other services @en-gb
definition: 食物、在宅介護や他のサービスを必要とするものを政府が支援すること @ja-jp
definition: Generalmente, ayuda del gobierno para quienes necesitan comida, vivienda, salud y otros servicios. @es
note: nessuno
in scheme: subjectcode
created: 2000-10-30T12:00:00+00:00
modified: 2010-12-15T17:01:09+00:00
broader: http://cv.iptc.org/newscodes/subjectcode/14000000