aborto
type: Concept
preferred label: Avortement @fr
preferred label: abortion @en-gb
preferred label: 中絶 @ja-jp
preferred label: Aborto @it
preferred label: Schwangerschaftsabbruch @de
definition: Généralement l'interruption provoquée et volontaire de la grossesse @fr
definition: Geralmente, interrupção planejada do processo de reprodução de vida humana.
definition: In der Regel der geplante Abbruch des Prozesses zur Reproduktion menschlichen Lebens. @de
definition: Usually the planned disruption of the process of reproduction of human life @en-gb
definition: In generale, l'interruzione volontaria della gravidanza @it
definition: Interrupção, planeada ou não, do processo de reprodução de vida humana.
definition: Usualmente es la interrupción planeada del proceso de reproducción de la vida humana. @es
definition: 通常、人間の生殖過程における計画的な途絶 @ja-jp
note: nessuno @it
in scheme: subjectcode
created: 2000-10-30T12:00:00+00:00
modified: 2010-12-15T17:01:09+00:00
broader: http://cv.iptc.org/newscodes/subjectcode/14000000