desaparecidos em conflitos (civis e militares)
type: Concept
preferred label: Personnes disparues en temps de guerre @fr
preferred label: Dispersi per Ostilità @it
preferred label: missing due to hostilities @en-gb
preferred label: Kriegsvermisste @de
preferred label: 戦争不明者 @ja-jp
preferred label: desaparecidos debido a las hostilidades @es
definition: Pessoas, civis e militares, desaparecidas durante ou após guerras.
definition: Gente, ambos, civiles y miltares, desaparecidos durante o después de hostilidades @es
definition: 戦争中や戦争後に行方不明になった市民または兵士 @ja-jp
definition: Zivilisten und Soldaten, die nach einer kriegerischen Auseinandersetzung vermisst werden. @de
definition: People, both civilian and military, missing during or after hostilities @en-gb
definition: Pessoas, civis e militares, desaparecidas durante ou após guerras, hostilidades.
definition: Persone, sia civili che militari, che scompaiono durante o dopo delle ostilità @it
definition: Civils ou militaires ayant disparus pendant ou après une guerre ou des hostilités @fr
note: nessuno @it
in scheme: subjectcode
created: 2003-11-26T12:00:00+00:00
modified: 2012-07-10T12:00:00+00:00
broader: http://cv.iptc.org/newscodes/subjectcode/14017000