Delinquenza giovanile
type: Concept
preferred label: juvenile delinquency @en-gb
preferred label: 非行 @ja-jp
preferred label: delincuencia juvenil @es
preferred label: delinquência juvenil @pt-pt
preferred label: Délinquance juvénile @fr
preferred label: Jugendkriminalität @de
definition: Incidents involving perpetrators who are minors. @en-gb
definition: 未成年者が加害者に含まれる事件 @ja-jp
definition: Incidentes que involucran la participación de menores de edad. @es
definition: Atos de delinquência realizados por menores de idade. @pt-pt
definition: Vorfälle in die minderjährige Täter verwickelt sind. @de
definition: Fenomeni delinquenziali perpetrati da minorenni, ad es. baby gang
definition: Actes de délinquance réalisés par des mineurs @fr
note: nessuno
in scheme: subjectcode
created: 2000-10-30T12:00:00+00:00
modified: 2010-12-15T17:01:09+00:00
broader: http://cv.iptc.org/newscodes/subjectcode/14000000