grupos populacionais
type: Concept
preferred label: Bevölkerungsgruppe @de
preferred label: Peuple @fr
preferred label: people @en-gb
preferred label: gente @es
preferred label: Gente, Persone @it
preferred label: 人々 @ja-jp
definition: Ensemble de personnes vivant sur un même territoire ou ayant en commun des mœurs, une culture, un système de gouvernement @fr
definition: Individuen als Ganzes, manchmal in verschiedene Klassen eingeteilt, wie Einheimische, Menschen einer Schicht etc. @de
definition: Individuos como un todo, algunas veces clasificadas en clases, como indígenas, gente de clase, etc. @es
definition: Insieme degli individui @it
definition: Individuals as a whole, sometimes broken down into various classes, such as indigenous people, people of class etc @en-gb
definition: Coletivos de pessoas, por vezes divididas por classes.
definition: Indivíduos como um todo, por vezes divididos por classes, como indígenas, pessoas de classe, etc.
definition: 時には土着の人々や様々な部類の人々など、色々な階層に分けられる個人全体 @ja-jp
note: nessuno @it
in scheme: subjectcode
created: 2003-04-05T12:00:00+00:00
modified: 2012-07-10T12:00:00+00:00
broader: http://cv.iptc.org/newscodes/subjectcode/14000000
narrower: http://cv.iptc.org/newscodes/subjectcode/14024001
narrower: http://cv.iptc.org/newscodes/subjectcode/14024002
narrower: http://cv.iptc.org/newscodes/subjectcode/14024003
narrower: http://cv.iptc.org/newscodes/subjectcode/14024004
narrower: http://cv.iptc.org/newscodes/subjectcode/14024005