Infanzia
type: Concept
preferred label: pré-adolescentes @pt-pt
preferred label: children @en-gb
preferred label: niños @es
preferred label: Enfants @fr
preferred label: Kind @de
preferred label: 子供 @ja-jp
definition: De la naissance à l'âge de la puberté @fr
definition: Immature people, usually up to the age of puberty @en-gb
definition: Noch nicht entwickelte Menschen, gewöhnlich bis zum Alter der Pubertät. @de
definition: Gente inmadura, Generalmente hasta la edad de la pubertad. @es
definition: 通常、思春期の年齢に至るまでの未熟な人々 @ja-jp
definition: Pessoas imaturas, geralmente até a idade da puberdade. @pt-br
definition: Bambini, considerati dalla nascita fino all'età della pubertà
definition: Pessoas que estão a chegar à idade da puberdade. @pt-pt
note: nessuno
in scheme: subjectcode
created: 2003-04-05T12:00:00+00:00
modified: 2012-07-10T12:00:00+00:00
broader: http://cv.iptc.org/newscodes/subjectcode/14024000