Condizioni sociali
type: Concept
preferred label: Condition sociale @fr
preferred label: Soziale Bedingung @de
preferred label: condições de vida @pt-pt
preferred label: social conditions @en-gb
preferred label: condiciones sociales @es
preferred label: 生活水準 @ja-jp
definition: Conditions under which people live in terms of housing, water supply, availability of education @en-gb
definition: Condições nas quais vivem as pessoas em termos de habitação, fornecimento de água, disponibilidade de educação. @pt-pt
definition: 住宅、給水、利用できる教育の見地から見た人々の生活状態 @ja-jp
definition: Condizioni in cui le persone vivono in fatto di abitazione, acqua, accesso all'istruzione
definition: Les conditions dans lesquelles vivent les individus en terme de logement, de possibilité d'éducation, d'accès à la nourriture et à l'eau @fr
definition: Probleme, die eine Reihe von Individuen in ihrem täglichen Leben betreffen, wie Unterkunft, Nahrung, Erziehung, persönliche Beziehungen. @de
definition: Condiciones bajo las cuales la gente vive en términos de hogar, agua, disponibilidad de educación. @es
note: nessuno
in scheme: subjectcode
created: 2003-04-05T12:00:00+00:00
modified: 2012-07-10T12:00:00+00:00
broader: http://cv.iptc.org/newscodes/subjectcode/14025000