Servizi sociali
type: Concept
preferred label: social services @en-gb
preferred label: 社会的支援 @ja-jp
preferred label: serviços sociais @pt-pt
preferred label: Sozialer Dienst @de
preferred label: Services sociaux @fr
preferred label: servicios sociales @es
definition: Programas de apoio público que visam melhorar o bem-estar de pessoas ou de grupos de pessoas. @pt-br
definition: Programme, die von der Regierung unterstützt werden zur Verbesserung des Wohlergehens von Individuen oder Gruppen von Individuen. @de
definition: Gobierno apoyado por programas para mejorar el bien común de las personas o grupos de personas. @es
definition: 個人、あるいは集団の幸福を増大させる政府の支援プログラム @ja-jp
definition: Government supported programs to improve the well-being of individuals or groups of individuals @en-gb
definition: Programas de apoio público que visam melhorar o bem-estar de pessoas. @pt-pt
definition: Les programmes publics visant à accroître le bien être des personnes ou de groupes de personnes @fr
definition: Programmi pubblici per migliorare il benessere di individui o gruppi di individui
note: nessuno
in scheme: subjectcode
created: 2003-04-05T12:00:00+00:00
modified: 2012-07-10T12:00:00+00:00
broader: http://cv.iptc.org/newscodes/subjectcode/14025000