death penalty policies
type: Concept
preferred label: políticas de pena de morte @pt-br
preferred label: Todesstrafe (Politik) @de
definition: Políticas nacionais ou internacionais relativas à pena de morte. @pt-br
definition: National or international polices regarding death sentences
definition: Nationale oder internationale Politik in Bezug auf Todesurteile. @de
in scheme: subjectcode
created: 2007-08-28T12:00:00+00:00
modified: 2012-07-10T12:00:00+00:00
broader: http://cv.iptc.org/newscodes/subjectcode/14025000