Bonifica Bellica
type: Concept
preferred label: remoción de pertrechos @es
preferred label: estatísticas (Sociedade) @pt-pt
preferred label: Déminage @fr
preferred label: Beseitigung von Kriegswaffenresten @de
preferred label: ordnance clearance @en-gb
preferred label: 爆発物除去 @ja-jp
definition: Remoção ou neutralização de elementos que permanecem ativos após o fim de guerras ou conflitos armados, como minas terrestres ou bombas de fragmentação. @pt-pt
definition: la remoción o neutralización de elementos que permanecen activos despues de un conflicto bélico, tales como minas terrestres o bombas de racimo. @es
definition: Rimozione o neutralizzazione di ordigni bellici che restano inesplosi dopo una guerra o un conflitto armato
definition: Das Entfernen oder Entschärfen von Waffen, wie Landminen oder Clusterbomben, die nach einem Krieg oder bewaffneten Konflikt übriggeblieben sind. @de
definition: Le déplacement, l'enlèvement ou la neutralisation d'engins explosifs tels que des mines après une guerre ou un conflit armé @fr
definition: 戦争や武力紛争後に残された地雷やクラスター爆弾などの兵器の除去または無効化 @ja-jp
definition: The removal or neutralization of ordnance such as landmines or cluster bombs, remaining after a war or armed conflict @en-gb
note: nessuno
in scheme: subjectcode
created: 2003-11-26T12:00:00+00:00
modified: 2012-07-10T12:00:00+00:00
broader: http://cv.iptc.org/newscodes/subjectcode/14000000