desportos aéreos
type: Concept
preferred label: deporte aéreo y de aviación @es
preferred label: Sports aériens et d'aviation @fr
preferred label: Sport Aviatori @it
preferred label: 航空スポーツ @ja-jp
preferred label: Luft- und Flugsport @de
preferred label: esportes aéreos
preferred label: aero and aviation sport @en-gb
definition: パラシューティング、自由落下(パラグライダー、ハンググライダー)、グライダー、軽航空機、動力飛行機(飛行機、超軽量飛行機、ヘリコプター) @ja-jp
definition: Paracaidismo, caída libre (parapente, aladeltismo), planeador,aerostático, vuelo motorizado (aeroplano, ultraliviano, helicóptero). @es
definition: Parachuting, freefall (parapente, delta-plane), gliding, aerostat, motorised flight (airplane, ultra light craft, helicopter) @en-gb
definition: Paracadutismo, volo a vela, mongolfiere, aerei a motore, elicottero ecc. @it
definition: Paraquedismo, queda livre (parapente, asa-delta), voo à vela, aeróstato, voo motorizado (avião, ultraleve, helicóptero).
definition: Paraquedismo, queda livre (parapente, asa-delta), voo a vela, aeróstato, voo motorizado (avião, ultraleve, helicóptero).
definition: Fallschirmspringen, freier Fall (Gleitschirm, Drachenfliegen), Segelfliegen, Ballon, Motorflug (Flugzeug, Leichtflugzeug, Hubschrauber). @de
definition: parachutisme, vol libre (parapente, aile delta) vol à voile, aérostat, vol à moteur (avion, planeur ultraléger motorisé, hélicoptère). @fr
note: nessuno @it
in scheme: subjectcode
created: 2000-10-30T12:00:00+00:00
modified: 2010-12-15T17:01:09+00:00
broader: http://cv.iptc.org/newscodes/subjectcode/15000000
narrower: http://cv.iptc.org/newscodes/subjectcode/15001001
narrower: http://cv.iptc.org/newscodes/subjectcode/15001002
broad match: http://cv.iptc.org/newscodes/mediatopic/15000000