Paracadutismo
type: Concept
preferred label: Parachutisme @fr
preferred label: paraquedismo @pt-pt
preferred label: Fallschirmspringen @de
preferred label: parachuting @en-gb
preferred label: paracaidismo @es
preferred label: パラシューティング @ja-jp
definition: Epreuves de saut en parachute : précision d'atterrissage, voltige et vol relatif en individuel ou par équipe @fr
definition: Competições de paraquedismo: aterragens de precisão, volteio, individual ou por equipas. @pt-pt
definition: Fallschirmsprung Wettbewerbe: Punktlandungen, Spannweite, Einzel und im Team. @de
definition: パラシューティング競技:個人や団体による正確な着地、曲芸 @ja-jp
definition: Gare di paracadutismo: atterraggi precisi, volteggi, individuali e di squadra
definition: Parachuting competitions: precision landings, voltige, individual and team @en-gb
definition: Competiciones de paracaidismo (aterrizajes de precisión, volteretas o vórtice, individual o por equipos). @es
note: nessuno
in scheme: subjectcode
created: 2000-10-30T12:00:00+00:00
modified: 2010-12-15T17:01:09+00:00
broader: http://cv.iptc.org/newscodes/subjectcode/15001000