Paracadutismo sportivo
type: Concept
preferred label: sky diving @en-gb
preferred label: salto em queda livre @pt-pt
preferred label: Sky Diving @de
preferred label: salto en caída libre @es
preferred label: Chute libre @fr
preferred label: スカイダイビング @ja-jp
definition: Parachuting competitions involving sky-diving @en-gb
definition: Competições de paraquedismo envolvendo salto em queda livre. @pt-br
definition: Epreuve de saut en parachute en chute libre @fr
definition: スカイダイビングを使ったパラシューティング競技 @ja-jp
definition: Competiciones de paracaidismo que involucran caída libre (salto desde una aeronave con movimientos durante la caída). @es
definition: Gare di paracadutismo sportivo in caduta libera
definition: Fallschirmsprung Wettbewerbe inklusive Sky Diving. @de
note: nessuno
in scheme: subjectcode
created: 2000-10-30T12:00:00+00:00
modified: 2010-12-15T17:01:09+00:00
broader: http://cv.iptc.org/newscodes/subjectcode/15001000