Combinata
type: Concept
preferred label: Kombination @de
preferred label: combinado @es
preferred label: Combiné @fr
preferred label: 複合 @ja-jp
preferred label: combined @en-gb
definition: Race, usually competed over two days that combines a downhill leg and a slalom leg rewarding the most complete skiers. Combined fastest time wins. @en-gb
definition: Rennen, in der Regel über zwei Tage, bei dem eine Abfahrtslaufetappe und eine Slalometappe kombiniert wird. Gewertet wird der perfekteste Skifahrer und die kombinierte schnellste Zeit gewinnt. @de
definition: 通常、滑降と回転の組み合わせで2日以上かけて競技を行い、最も完成されたスキーヤーとしての価値がある。組み合わせの合計タイムで競う @ja-jp
definition: Corrida, geralmente disputada durante dois dias, que combina uma prova de downhill e outra de slalom, premiando os esquiadores com os tempos combinados mais rápidos. @pt-br
definition: Carrera disputada en dos mangas, que combina una prueba de descenso y otra de slalom, premiando a los esquiadores más completos y rápidos. @es
definition: Gara in cui vengono associati i risultati di una libera e quelli di uno slalom
definition: course qui associe les résultats d'une descente et d'un slalom @fr
note: nessuno
in scheme: subjectcode
created: 2000-10-30T12:00:00+00:00
modified: 2010-12-15T17:01:09+00:00
broad match: http://cv.iptc.org/newscodes/mediatopic/20001057
broader: http://cv.iptc.org/newscodes/subjectcode/15002000