liga canadiana de futebol
type: Concept
preferred label: Entry deleted @it
preferred label: entry deleted @fr
preferred label: liga canadense de futebol
preferred label: entrada borrada @es
preferred label: CFL @en-gb
preferred label: Kandadische Football Liga CFL @de
definition: 0 @es
definition: Entry deleted @it
definition: A Liga Canadense de Futebol (CFL ou LCF) é uma liga profissional, localizada no Canadá, que joga futebol canadense.
definition: A Liga Canadiana de Futebol (CFL ou LCF) é uma liga profissional, localizada no Canadá, que joga futebol canadiano.
definition: Kandadische Football Liga CFL, auch bekannt als Ligue Canadienne de Football (LCF), ist eine Profi-Liga die ausschließlich in Kanada beheimatet ist und Canadian Football spielt. @de
definition: The Canadian Football League (CFL), also known as Ligue Canadienne de Football (LCF), is a professional league located entirely in Canada that plays Canadian football. @en-gb
note: re-added, with corresponding explanation @en-gb
note: nessuno @it
in scheme: subjectcode
created: 2000-10-30T12:00:00+00:00
modified: 2010-12-15T17:01:09+00:00
broader: http://cv.iptc.org/newscodes/subjectcode/15003000
broad match: http://cv.iptc.org/newscodes/mediatopic/20000876