400 m
type: Concept
preferred label: ４００ｍ @ja-jp
preferred label: 400m @fr
definition: Corsa nella distanza di 400 metri con il miglior tempo
definition: Correr uma distância de 400 metros. Ganha o tempo mais rápido. @pt-pt
definition: Running over a distance of 400 metres with the fastest time winning @en-gb
definition: Laufen über eine Distanz von 400 Metern, wobei die Bestzeit gewinnt. @de
definition: 400m競走 @ja-jp
definition: Competición que consiste en correr una distancia de 400m en el mejor tiempo. @es
definition: compétition qui consiste à parcourir un tour de piste (400 m) dans le meilleur temps @fr
note: nessuno
in scheme: subjectcode
created: 2000-10-30T12:00:00+00:00
modified: 2010-12-15T17:01:09+00:00
broader: http://cv.iptc.org/newscodes/subjectcode/15005000
broad match: http://cv.iptc.org/newscodes/mediatopic/20000844