800 m
type: Concept
preferred label: 800m @fr
preferred label: ８００ｍ @ja-jp
definition: Correr uma distância de 800 metros. Ganha o tempo mais rápido.
definition: Running over a distance of 800 metres with the fastest time winning @en-gb
definition: Corsa nella distanza di 800 metri con il miglior tempo @it
definition: Competición que consiste en correr una distancia de 800m en el mejor tiempo. @es
definition: compétition qui consiste à parcourir deux tours de piste (800 m) dans le meilleur temps @fr
definition: Laufen über eine Distanz von 800 Metern, wobei die Bestzeit gewinnt. @de
definition: 800m競走 @ja-jp
note: nessuno @it
in scheme: subjectcode
created: 2000-10-30T12:00:00+00:00
modified: 2010-12-15T17:01:09+00:00
broader: http://cv.iptc.org/newscodes/subjectcode/15005000
broad match: http://cv.iptc.org/newscodes/mediatopic/20000838