2000 m
type: Concept
preferred label: ２０００ｍ @ja-jp
preferred label: 2000m @fr
definition: Laufen über eine Distanz von 2000 Metern, wobei die Bestzeit gewinnt.
definition: Corsa nella distanza di 2000 metri con il miglior tempo @it
definition: Correr uma distância de 2000 metros. Ganha o tempo mais rápido. @pt-pt
definition: Competición que consiste en correr una distancia de 2000m en el mejor tiempo. @es
definition: Running over a distance of 2000 metres with the fastest time winning @en-gb
definition: compétition qui consiste à couvrir 2000 m en un temps minimum. @fr
definition: 2,000m競走 @ja-jp
note: nessuno @it
in scheme: subjectcode
created: 2000-10-30T12:00:00+00:00
modified: 2010-12-15T17:01:09+00:00
broader: http://cv.iptc.org/newscodes/subjectcode/15005000
broad match: http://cv.iptc.org/newscodes/mediatopic/20000836