10.000 m
type: Concept
preferred label: 10000m @fr
preferred label: １００００ｍ @ja-jp
preferred label: 10 km @de
preferred label: 10,000 m @en-gb
definition: Correr uma distância de 10000 metros. Ganha o tempo mais rápido. @pt-br
definition: Corsa nella distanza di 10000 metri con il miglior tempo
definition: Running over a distance of 10,000 metres with the fastest time winning @en-gb
definition: 10,000m競走 @ja-jp
definition: Competición que consiste en correr una distancia de 10.000m en el mejor tiempo. @es
definition: Laufen über eine Distanz von 10000 Metern, wobei die Bestzeit gewinnt. @de
definition: compétition qui consiste à couvrir 10 000 m en un temps minimum. @fr
note: nessuno
in scheme: subjectcode
created: 2000-10-30T12:00:00+00:00
modified: 2010-12-15T17:01:09+00:00
broader: http://cv.iptc.org/newscodes/subjectcode/15005000
broad match: http://cv.iptc.org/newscodes/mediatopic/20000836