400 ostacoli
type: Concept
preferred label: 400m vallas @es
preferred label: 400 m barreiras @pt-br
preferred label: ４００ｍ障害 @ja-jp
preferred label: 400 m hurdles @en-gb
preferred label: 400 m Hürdenlauf @de
preferred label: 400mhaies @fr
definition: Rennen über 400 Meter so schnell wie möglich, wobei 10 Hürden auf der Strecke übersprungen werden müssen. @de
definition: Corsa nella distanza di 400 metri da percorrere saltando 10 ostacoli collocati sulla pista con il miglior tempo
definition: Carrera de velocidad que consiste en cubrir 400 metros saltando diez vallas a lo largo del camino. @es
definition: Competição que consiste em correr uma distância de 400 metros saltando 10 barreiras colocadas ao longo da pista. @pt-pt
definition: トラック上の10のハードルをとび超え、できるだけ速く400mを走るレース @ja-jp
definition: course de vitesse sur un tour de piste (400 m) parsemé de 10 haies @fr
definition: Race consisting of covering 400 metres as fast as possible while jumping over 10 hurdles placed on the track @en-gb
note: nessuno
in scheme: subjectcode
created: 2000-10-30T12:00:00+00:00
modified: 2010-12-15T17:01:09+00:00
broader: http://cv.iptc.org/newscodes/subjectcode/15005000
broad match: http://cv.iptc.org/newscodes/mediatopic/20000834