3000 siepi
type: Concept
preferred label: 3000m con obstáculos @es
preferred label: 3000 m steeplechase @en-gb
preferred label: 3000 m obstáculos @pt-pt
preferred label: ３０００ｍ障害 @ja-jp
preferred label: 3000m steeple @fr
preferred label: 3000 m Hindernislauf @de
definition: Competição que consiste em correr uma distância de 3000 metros saltando 28 barreiras e 7 obstáculos de água colocados ao longo da pista. @pt-br
definition: Corsa nella distanza di 3000 metri, saltando 28 ostacoli alti 91,4 centimetri e sette ostacoli d'acqua, con il miglior tempo
definition: Carrera de velocidad que consiste en cubrir 3000 metros, saltando 28 vallas de 91.4 cm de altura y 7 obstáculos de agua. @es
definition: Race consisting of covering 3000 metres as fast as possible while jumping over 28 hurdles which are 91/4 centimetres high and seven water obstacles @en-gb
definition: 91.4cmの高さをもつ28のハードルと7つの水障害をジャンプしながら、できる限り早く3000mに到達する競技 @ja-jp
definition: Rennen über 3000 Meter so schnell wie möglich, wobei 28 Hürden auf der Strecke übersprungen werden müssen, die 9ü Zentimeter hoch sind und 7 Wasserhindernisse. @de
definition: course d'obstacles sur piste de 3000 m. L'épreuve comporte le franchissement de 28 haies d'une hauteur 91,4 cm et 7 sauts de rivière (un bassin artificiel). @fr
note: nessuno
in scheme: subjectcode
created: 2000-10-30T12:00:00+00:00
modified: 2010-12-15T17:01:09+00:00
broader: http://cv.iptc.org/newscodes/subjectcode/15005000
broad match: http://cv.iptc.org/newscodes/mediatopic/20000827