Salto in alto
type: Concept
preferred label: salto alto (de altura) @es
preferred label: salto em altura @pt-pt
preferred label: Saut en hauteur @fr
preferred label: 走り高跳び @ja-jp
preferred label: Hochsprung @de
preferred label: high jump @en-gb
definition: compétition consistant à sauter par la force de son corps le plus haut possible au dessus d'une barre transversale. L'athlète est éliminé après trois essais manqués successifs, indépendamment de la hauteur. @fr
definition: Competitors jump as high as possible over a bar which is raised each time they clear the height. The highest clearance wins. @en-gb
definition: Competizione che consiste nel superare con un salto una barra orizzontale, la cui altezza viene aumentata ogni volta che viene superata senza farla cadere. Vince chi salta più in alto
definition: 競技者は、その高さをクリアするごとに上げられるバーをできるだけ高く跳ぶ。最も高い(バー)をクリアした人が勝つ @ja-jp
definition: Prova em que os atletas saltam o mais alto possível sobre uma barra horizontal, que é subida a cada ronda de saltos. Ganha quem atingir a marca mais alta. @pt-br
definition: Prueba en la que el atleta debe saltar lo más alto posible sobre una barra transversal, la cual es elevada cada vez que la misma es sorteada sin derribarla. Consiste de tres intentos y se toma la marca más alta. @es
definition: Wettkämpfer springen so hoch wie möglich über eine Latte, die höher gehängt wird, wenn eine Höhe erreicht ist. Die höchste Höhe gewinnt. @de
note: nessuno
in scheme: subjectcode
created: 2000-10-30T12:00:00+00:00
modified: 2010-12-15T17:01:09+00:00
broader: http://cv.iptc.org/newscodes/subjectcode/15005000