salto em distância
type: Concept
preferred label: salto em comprimento
preferred label: Weitsprung @de
preferred label: 走り幅跳び @ja-jp
preferred label: long jump @en-gb
preferred label: Salto in lungo @it
preferred label: Saut en longueur @fr
preferred label: salto largo (de longitud) @es
definition: Wettkämpfer beschleunigen über eine kurze Distanz ihre Geschwindigkeit und springen dann so weit wie möglich ab einem vorgegeben Punkt in eine Sandgrube. Der weiteste Sprung gewinnt. @de
definition: Prova em que os atletas fazem uma corrida curta para ganhar velocidade até um ponto determinado e depois se impulsionam saltando para a frente antes de cairem sobre uma caixa de areia. Ganha quem fizer o salto mais longo.
definition: Dopo aver acquistato velocità con un breve scatto, gli atleti saltano in avanti da un dato punto il più lontano possibile in una pista di sabbia. Il salto più lungo vince @it
definition: Competitors build up speed over a short sprint and them attempt to jump as far forward as they can from a given point into sand trap. The longest jump wins. @en-gb
definition: Prueba en la que el atleta debe saltar la mayor distancia posible, desde un punto determinado, cayendo dentro de una superficie de arena. @es
definition: épreuve qui consiste à sauter le plus loin possible à partir d'une planche d'appel. @fr
definition: 競技者は、短距離で疾走し、与えられたポイントから砂場(サンドトラップ)の中へできる限り遠くへジャンプすることを試みる。最も遠くへジャンプした人が勝つ @ja-jp
note: nessuno @it
in scheme: subjectcode
created: 2000-10-30T12:00:00+00:00
modified: 2010-12-15T17:01:09+00:00
broader: http://cv.iptc.org/newscodes/subjectcode/15005000