triple jump
type: Concept
preferred label: Dreisprung @de
preferred label: Salto Triplo @it
preferred label: salto triplo @pt-br
preferred label: triplo salto @pt-pt
preferred label: 三段跳び @ja-jp
preferred label: Triple saut @fr
preferred label: salto triple @es
definition: 競技者は、短距離で疾走し、その時にホップ、ステップ(スキップ)、ジャンプという技法を用いてできる限り遠くへジャンプすることを試みる。最も遠くへジャンプした人が勝つ @ja-jp
definition: Wettkämpfer beschleunigen ihre Geschwindigkeit über eine kurze Distanz und versuchen dann so weit wie möglich zu springen, wobei sie einen Hop, einen Step und einen Jump benutzen. Der längste Sprung gewinnt. @de
definition: saut en longueur précédé de deux bonds. Le saut s'effectuera de telle sorte que le concurrent retombe d'abord sur le pied avec lequel il a pris son appel, puis au second saut, sur l'autre pied à partir duquel le 3ème saut est fait. @fr
definition: Prova em que os atletas fazem uma corrida curta para ganhar velocidade até um ponto determinado e depois se impulsionam encadeando três saltos sucessivos que terminam com uma queda sobre uma caixa de areia. Ganha quem fizer o salto mais longo. @pt-br
definition: Prueba en la que los competidores tratan de alcanzar la mayor velocidad en tres piques cortos, con diferente pierna cada uno y luego saltar lo más lejos que puedan mediante una técnica determinada. @es
definition: Competitors build up speed over a short sprint and then attempt to jump as far forward as they can using a hop, skip and a jump technique. The longest jump wins.
definition: Come il salto in lungo, ma preceduto da due slanci prima dell'ultimo salto in avanti possibile in una pista di sabbia. Il salto più lungo vince @it
note: typo fixed in Explanation
note: nessuno @it
in scheme: subjectcode
created: 2000-10-30T12:00:00+00:00
modified: 2010-12-15T17:01:09+00:00
broader: http://cv.iptc.org/newscodes/subjectcode/15005000