4x100
type: Concept
preferred label: 4x100 m @de
preferred label: ４００ｍリレー @ja-jp
preferred label: Relais 4x100 m @fr
preferred label: 4 x 100m @es
definition: Team race involving four runners each covering 100 metres. @en-gb
definition: 100mずつを4人で走るリレー競技 @ja-jp
definition: Corrida de equipa em que 4 corredores fazem 100 metros cada um. @pt-pt
definition: Carrera de relevos por equipos de 4 corredores, los cuales deben de cubrir un recorrido de 100m cada uno. @es
definition: Staffetta con 4 corridori, ciascuno dei quali corre per 100 metri
definition: Corrida de equipe em que 4 corredores fazem 100 metros cada um. @pt-br
definition: épreuves par équipes de quatre coureurs sur 100m @fr
definition: Mannschaftsrennen mit 4 Läufern, von denen jeder 100 Meter läuft. @de
note: nessuno
in scheme: subjectcode
created: 2000-10-30T12:00:00+00:00
modified: 2010-12-15T17:01:09+00:00
broader: http://cv.iptc.org/newscodes/subjectcode/15005000
broad match: http://cv.iptc.org/newscodes/mediatopic/20000842