heptatlo
type: Concept
preferred label: Siebenkampf @de
preferred label: heptathlon @es
preferred label: Eptathlon @it
preferred label: 七種競技 @ja-jp
definition: 7épreuves individuelles que les athlètes féminines disputent pendant 2 jours. 1er jour : 100 m haies, saut en hauteur, lancer du poids, 200 m. 2ème jour : saut en longueur, lancer du javelot, 800 m. @fr
definition: 2日間に渡って7種の異なる競技を行う女子個人競技。1日目－100mハードル、走り高跳び、砲丸投げ、200m走、2日目－走り幅跳び、槍投げ、800m走 @ja-jp
definition: Einzelwettkampf der Frauen, umfasst 7 Disziplinen über 2 Tage: 1. Tag - 100 m Hürden, Hochsprung, Kugelstoßen, 200 Meter. 2. Tag - Weitsprung, Speerwerfen, 800 Meter. @de
definition: Competición individual de mujeres con pruebas en 7 disciplinas disputadas durante 2 días. Primer día: 100m. con vallas, salto alto, lanzamiento de bala, y 200 m. Segundo día: Salto largo, jabalina, y 800 m. @es
definition: Competição individual feminina que consiste em acumular pontos em 7 provas diferentes durante 2 dias. 1º dia: 100m barreiras, salto em altura, arremesso de peso e 200m. 2º dia: salto em distância, lançamento de dardo e 800m.
definition: Individual women's competition involving seven separate disciplines over two days. 1st day - 100m hurdles, high-jump, shot-putt, 200 metres. 2nd day - long-jump, javelin, 800 metres. @en-gb
definition: Competizione individuale femminile che comprende 7 discipline da svolgere in due giorni. 1. giorno: 100 ostacoli, salto in alto, getto del peso, 200 metri. 2.giorno: salto in lungo, lancio del giavellotto, 800 metri @it
definition: Competição individual feminina que consiste em acumular pontos em 7 provas diferentes durante 2 dias. 1º dia: 100m barreiras, salto em altura, lançamento do peso e 200m. 2º dia: salto em comprimento, lançamento do dardo e 800m.
note: nessuno @it
note: typo fixed in Explanation @en-gb
in scheme: subjectcode
created: 2000-10-30T12:00:00+00:00
modified: 2010-12-15T17:01:09+00:00
broader: http://cv.iptc.org/newscodes/subjectcode/15005000