50 yards
type: Concept
preferred label: 50 yardas @es
preferred label: 50 jardas @pt-pt
preferred label: ５０ヤード @ja-jp
definition: 50ヤードに渡り最も速いタイム(を出した人)が勝利する短距離競走 @ja-jp
definition: Kurzstrecken Sprint über 50 Yards, wobei die schnellste Zeit gewinnt.
definition: Breve gara di velocità sulle 50 yarde @it
definition: Consiste en cubrir 50 yardas en el menor tiempo posible, con el más rápido como ganador. @es
definition: Short sprint race over 50 yards with the fastest time winning. @en-gb
definition: Prova de velocidade que consiste em correr 50 jardas. Ganha o tempo mais rápido. @pt-pt
definition: compétition qui consiste à couvrir 50 yards en un temps minimum. @fr
note: nessuno @it
in scheme: subjectcode
created: 2000-10-30T12:00:00+00:00
modified: 2010-12-15T17:01:09+00:00
broader: http://cv.iptc.org/newscodes/subjectcode/15005000
broad match: http://cv.iptc.org/newscodes/mediatopic/20000844