50 yards ostacoli
type: Concept
preferred label: 50 jardas barreiras @pt-pt
preferred label: 50 yards Hürdenlauf @de
preferred label: 50 yardas con vallas @es
preferred label: 50 yard haies @fr
preferred label: ５０ヤード障害 @ja-jp
preferred label: 50 yard hurdles @en-gb
definition: course de vitesse sur 50 yards parsemés de haies @fr
definition: Breve gara di velocità sulle 50 yarde a ostacoli
definition: Short sprint race over 50 yards interspersed with hurdles. @en-gb
definition: Kurzstrecken Sprint über 50 Yards, unterbrochen durch Hürden. @de
definition: 50ヤードに渡りハードルが散在する短距離競走 @ja-jp
definition: Prova de velocidade que consiste em correr 50 jardas com barreiras. Ganha o tempo mais rápido. @pt-br
definition: Igual a la anterior pero con vallas interpuestas en el camino. @es
note: nessuno
in scheme: subjectcode
created: 2000-10-30T12:00:00+00:00
modified: 2010-12-15T17:01:09+00:00
broader: http://cv.iptc.org/newscodes/subjectcode/15005000
broad match: http://cv.iptc.org/newscodes/mediatopic/20000834