60 m
type: Concept
preferred label: 60m @es
preferred label: ６０ｍ @ja-jp
definition: Prova de velocidade que consiste em correr 60 m. Ganha o tempo mais rápido. @pt-br
definition: Breve gara di velocità sui 60 m @it
definition: Kurzstrecken Sprint über 60 Meter, wobei die schnellste Zeit gewinnt.
definition: Short sprint race over 60 metres with the fastest time winning. @en-gb
definition: Carrera corta de 60m. con el más rápido como ganador. @es
definition: 60メートルに渡り最も速いタイム(を出した人)が勝利する短距離競走(short sprint race) @ja-jp
definition: compétition qui consiste à couvrir 60 m en un temps minimum. @fr
note: nessuno @it
in scheme: subjectcode
created: 2000-10-30T12:00:00+00:00
modified: 2010-12-15T17:01:09+00:00
broader: http://cv.iptc.org/newscodes/subjectcode/15005000
broad match: http://cv.iptc.org/newscodes/mediatopic/20000844