300 yards
type: Concept
preferred label: 300 yardas @es
preferred label: ３００ヤード @ja-jp
preferred label: 300 jardas @pt-br
definition: Prova que consiste em correr 300 jardas. Ganha o tempo mais rápido. @pt-pt
definition: Carrera de velocidad sobre 300 yardas. @es
definition: Corsa di 300 yards @it
definition: Race over 300 yards with the fastest time winning. @en-gb
definition: compétition qui consiste à couvrir 300 yards en un temps minimum.
definition: Rennen über 300 Yards, wobei die schnellste Zeit gewinnt. @de
definition: 300ヤードに渡り最も速いタイム(を出した人)が勝利する競走 @ja-jp
note: nessuno @it
in scheme: subjectcode
created: 2000-10-30T12:00:00+00:00
modified: 2010-12-15T17:01:09+00:00
broader: http://cv.iptc.org/newscodes/subjectcode/15005000
broad match: http://cv.iptc.org/newscodes/mediatopic/20000844