Major League Baseball - liga americana
type: Concept
preferred label: American League @fr
preferred label: liga mayor de béisbol (profesional estadounidense) - liga americana @es
preferred label: Major League Baseball (North American Professional) - American League @en-gb
preferred label: Major League - American League @it
preferred label: ＭＬＢア・リーグ @ja-jp
definition: Baseball Liga bestehend aus 14 Teams. @de
definition: Lega professionisti formata da 14 squadre @it
definition: Liga de béisbol compuesta por 14 equipos. @es
definition: 14チームで構成される野球のリーグ @ja-jp
definition: Liga de beisebol composta por 14 equipas.
definition: Liga de beisebol composta por 14 equipes.
definition: Baseball league comprising 14 teams. @en-gb
definition: une des 2 ligues de la Major League de Base-ball composée de 14 équipes @fr
note: nessuno @it
in scheme: subjectcode
created: 2000-10-30T12:00:00+00:00
modified: 2010-12-15T17:01:09+00:00
broader: http://cv.iptc.org/newscodes/subjectcode/15007000
broad match: http://cv.iptc.org/newscodes/mediatopic/20000849