Major League - National League
type: Concept
preferred label: Major League Baseball (North American Professional) - National League @de
preferred label: Major League Baseball - liga nacional @pt-pt
preferred label: ＭＬＢナ・リーグ @ja-jp
preferred label: liga mayor de béisbol (profesional estadounidense) - liga nacional. @es
preferred label: National League @fr
definition: Liga de beisebol composta por 16 equipes. @pt-br
definition: Liga de beisebol composta por 16 equipas. @pt-pt
definition: 16チームで構成される野球のリーグ @ja-jp
definition: une des 2 ligues de la Major League de Base-ball composée de 16 équipes @fr
definition: Baseball league comprising 16 teams. @en-gb
definition: Baseball Liga bestehend aus 16 Teams. @de
definition: Lega professionisti formata da 16 squadre
definition: Liga de béisbol compuesta por 16 equipos. @es
note: nessuno
in scheme: subjectcode
created: 2000-10-30T12:00:00+00:00
modified: 2010-12-15T17:01:09+00:00
broad match: http://cv.iptc.org/newscodes/mediatopic/20000849
broader: http://cv.iptc.org/newscodes/subjectcode/15007000