Major League Playoffs
type: Concept
preferred label: Major League Baseball Playoffs @pt-br
preferred label: Playoffs @fr
preferred label: playoffs de la liga mayor de béisbol @es
preferred label: ＭＬＢプレーオフ @ja-jp
definition: Consists of several rounds of play to determine representatives to the U.S.-based World Series @en-gb
definition: 米国を拠点として開催されるワールドシリーズの代表チームを決めるために行われる数試合のこと @ja-jp
definition: Fase final de classificação que consiste em vários encontros para determinar os representantes da World Series de beisebol norte-americana. @pt-br
definition: chaque équipe dispute un championnat à l'intérieur de sa ligue de base-ball. A la fin de la saison ont lieu les play-offs @fr
definition: Besteht aus verschiedenen Spielrunden, um die Repräsentanten der U.S. World Series zu bestimmen. @de
definition: Turni di playoff della Major League
definition: Fase final de clasificación que consiste de varios encuentros, para determinar los representantes de Estados Unidos, tomando como base las series mundiales. @es
note: nessuno
in scheme: subjectcode
created: 2003-11-26T12:00:00+00:00
modified: 2012-07-10T12:00:00+00:00
broader: http://cv.iptc.org/newscodes/subjectcode/15007000
broad match: http://cv.iptc.org/newscodes/mediatopic/20000849