National Basketball Association (North American Professional)
type: Concept
preferred label: NBA @fr
preferred label: nba - asociación nacional de básquetbol (profesional estadounidense) @es
preferred label: ＮＢＡ @ja-jp
preferred label: National Basketball Association (NBA, North American Professional) @de
definition: A NBA é a organização que gere o basquete profissional nos Estados Unidos. A NBA é formada por duas conferências (Este e Oeste) e por 4 divisões (Atlântica e Central para Este, Centro-oeste e Pacífico para Oeste). @pt-br
definition: La National Basket Association (NBA) gère le basket professionnel américain. 2 conférences (est, ouest), 4 divisions ( Atlantique et Centrale pour l'est et Centre-Ouest et Pacifique pour l'ouest), @fr
definition: The NBA is the umbrella organisation running professional basketball in the United States. The NBA is made up of two conferences (east and west), four divisions (Atlantic and Central for the East, and Midwest and Pacific for the west).
definition: A NBA é a organização que gere o basquetebol profissional nos Estados Unidos. A NBA é formada por duas conferências (Este e Oeste) e por 4 divisões (Atlântica e Central para Este, Centro-Oeste e Pacífico para Oeste). @pt-pt
definition: NBAは米国でプロバスケットボールを管理する組織である。NBAは(東部と西部)の2つの連盟、4つのディビジョン(東部にはアトランティックとセントラル、そして西部にはミッドウェストとパシフィック)がある @ja-jp
definition: La NBA es la organización que nuclea el básquetbol profesional en los Estados Unidos. Está compuesta de dos conferencias (Este y Oeste) y cuatro divisiones (Atlántico y Central para el Este, Medioeste y Pacífico para el Oeste). @es
definition: Die NBA ist der Dachverband des professionellen Basketball in den USA. Die NBA besteht aus zwei Konferenzen (ost und west), 4 Abteilungen (Atlantik und Zentral für den Osten, Mittelwesten und Pazifik für den Westen). @de
definition: National Basketball Association, la pallacanestro professionale negli Stati Uniti. @it
note: typo fixed in Explanation
note: nessuno @it
in scheme: subjectcode
created: 2000-10-30T12:00:00+00:00
modified: 2010-12-15T17:01:09+00:00
broader: http://cv.iptc.org/newscodes/subjectcode/15008000
broad match: http://cv.iptc.org/newscodes/mediatopic/20000851