WNBA
type: Concept
preferred label: 女子プロバスケットリーグ @ja-jp
preferred label: Ligue professionnelle féminine @fr
preferred label: liga profesional femenina @es
preferred label: Professionale femminile @it
preferred label: professional - Women general @en-gb
preferred label: Professional - Frauen allgemein @de
definition: Liga de basquetebol profissional feminino.
definition: Professionelle Liga der Frauen. @de
definition: Liga de basquete profissional feminino.
definition: Liga Profesional Femenina @es
definition: 女子のプロリーグ @ja-jp
definition: Lega professionale femminile @it
definition: ligue professionnelle féminine. @fr
definition: Women's professional league @en-gb
note: nessuno @it
in scheme: subjectcode
created: 2000-10-30T12:00:00+00:00
modified: 2010-12-15T17:01:09+00:00
broad match: http://cv.iptc.org/newscodes/mediatopic/20000851
broader: http://cv.iptc.org/newscodes/subjectcode/15008000