netball suíço
type: Concept
preferred label: Swiss netball @en-gb
preferred label: Netball svizzero @it
preferred label: Netball suisse @fr
preferred label: netball suizo @es
preferred label: スイス・ネットボール @ja-jp
preferred label: Schweizer Korbball @de
definition: バスケットボールに似ているが、ゴールには板がついてない。主に女性が行う @ja-jp
definition: Esporte feminino semelhante ao basquetebol, mas sem tabela para sustentar o cesto e regras suíças.
definition: Similar al básquetbol, pero sin tablero. Principalmente jugado por mujeres. @es
definition: Ähnlich dem Basketball. Der Korb ist ohne Brett. Wird hauptsächlich von Frauen gespielt. @de
definition: Desporto feminino semelhante ao basquetebol, mas sem tabela para sustentar o cesto e regras suíças.
definition: Similar to Basketball. Basket without a board. Mainly executed by women @en-gb
definition: Simile alla pallacanestro, ma privo dell'asse di sostegno del canestro. Praticato principalmente da donne @it
definition: Sport féminin similaire au basket-ball, mais sans planche pour soutenir le panier appliquant les réglements suisses. @fr
note: nessuno @it
in scheme: subjectcode
created: 2003-11-26T12:00:00+00:00
modified: 2012-07-10T12:00:00+00:00
broader: http://cv.iptc.org/newscodes/subjectcode/15008000
broad match: http://cv.iptc.org/newscodes/mediatopic/20001010