biatlo
type: Concept
preferred label: biatlón @es
preferred label: バイアスロン @ja-jp
preferred label: Biathlon @fr
preferred label: biathlon @en-gb
definition: Competizione di sci da fondo in forma di inseguimento su un percorso di 12,5 km con serie di tiri al bersaglio con la carabina @it
definition: course de ski de fond disputée en style libre, entrecoupée de séries de tir à la carabine sur des cibles. @fr
definition: A combination of cross country skiing and target shooting in a pursuit format. @en-gb
definition: Prova que combina esqui de fundo com tiro ao alvo, em uma corrida de perseguição de 12.5 km.
definition: Eine Kombination aus Skilanglauf und Schießen auf Zielscheiben (mit Verfolgungsstart) @de
definition: Prova que combina esqui de fundo com tiro ao alvo, numa corrida perseguição de 12.5 km.
definition: Combinación de esquí a campo traviesa y tiro al blanco, sobre un curso de 12,500 km en forma de persecución. @es
definition: 12.5Kコース上の追い抜き形式で、クロスカントリースキーとターゲット射撃を組み合わせたもの @ja-jp
note: nessuno @it
in scheme: subjectcode
created: 2000-10-30T12:00:00+00:00
modified: 2010-12-15T17:01:09+00:00
broader: http://cv.iptc.org/newscodes/subjectcode/15000000
narrower: http://cv.iptc.org/newscodes/subjectcode/15009001
narrower: http://cv.iptc.org/newscodes/subjectcode/15009002
narrower: http://cv.iptc.org/newscodes/subjectcode/15009003
narrower: http://cv.iptc.org/newscodes/subjectcode/15009004
narrower: http://cv.iptc.org/newscodes/subjectcode/15009005
narrower: http://cv.iptc.org/newscodes/subjectcode/15009006