15 Km
type: Concept
preferred label: 15 km @es
preferred label: Einzelrennen der Damen @de
preferred label: 7.5 km @pt-pt
preferred label: １５ｋｍ @ja-jp
definition: Competizione di velocità femminile sotto forma di inseguimento in tre giri con le concorrenti fatte partire ad intervalli di un minuto una dall'altra
definition: Competição individual feminina em formato de velocidade, disputada em três voltas, num total de 7.5 km. As participantes partem com intervalos de 1 minuto. @pt-pt
definition: Individual women's race in sprint format staged over three laps with competitors setting off at intervals of a minute. @en-gb
definition: 競技者が、1分おきに出発して3周回する、女子個人のスプリント競技 @ja-jp
definition: course individuelle dames, disputée sur le modèle du sprint avec 3 boucles de circuit. Les concurrents s'élancent toutes les minutes. @fr
definition: Rennen über fünf Runden. Es wird zwischen den Runden abwechselnd je zweimal liegend und stehend auf fünf Ziele geschossen. Jeder Fehlschuss wird durch eine Strafminute kompensiert. @de
definition: Carrera individual para damas disputada en la modalidad sprint, que consiste en etapas de tres vueltas al circuito de 15 km. Las competidoras largan con intervalos de un minuto. @es
note: typo fixed in Explanation @en-gb
note: nessuno
in scheme: subjectcode
created: 2000-10-30T12:00:00+00:00
modified: 2010-12-15T17:01:09+00:00
broader: http://cv.iptc.org/newscodes/subjectcode/15009000
broad match: http://cv.iptc.org/newscodes/mediatopic/20000852