20 Km
type: Concept
preferred label: 20 km @pt-br
preferred label: Einzelrennen der Herren @de
preferred label: ２０ｋｍ @ja-jp
definition: Competição individual masculina em formato de velocidade, disputada em três voltas, num total de 20 km. Os participantes partem com intervalos de 1 minuto. @pt-pt
definition: Competizione di velocità individuale maschile in cinque giri dove i concorrenti partono ad intervalli di un minuto uno dall'altro
definition: Individual men's race in sprint format staged over five laps with competitors setting off at intervals of a minute. @en-gb
definition: course individuelle hommes, disputée sur le modèle du sprint avec 5 boucles de circuit. Les concurrents s'élancent toutes les minutes. @fr
definition: Rennen über fünf Runden. Es wird zwischen den Runden abwechselnd je zweimal liegend und stehend auf fünf Ziele geschossen. Jeder Fehlschuss wird durch eine Strafminute kompensiert. @de
definition: 競技者が、1分おきに出発して5周回する、男子個人のスプリント競技 @ja-jp
definition: Carrera individual para hombres en la modalidad sprint, que consiste en etapas de cinco vueltas al circuito de 20 km, a intervalos de un minuto @es
note: nessuno
in scheme: subjectcode
created: 2000-10-30T12:00:00+00:00
modified: 2010-12-15T17:01:09+00:00
broader: http://cv.iptc.org/newscodes/subjectcode/15009000
broad match: http://cv.iptc.org/newscodes/mediatopic/20000852