15.5 km perseguição
type: Concept
preferred label: persecución 12,5 km @es
preferred label: １２．５ｋｍ追い抜き @ja-jp
preferred label: Mixed Staffel @de
preferred label: Poursuite 12.5 km @fr
preferred label: Inseguimento 12,5 km @it
preferred label: 12.5 km pursuit @en-gb
definition: スプリントの結果でスタート順が決まる。レースはターゲット射撃(立ったまま又はうつ伏せ)を含み5周続ける @ja-jp
definition: A largada é determinada pelos resultados da corrida de velocidade. Corrida disputada em 5 voltas ao circuito e com rondas de tiro ao alvo (de pé ou deitado).
definition: A ordem de partida é determinada pelos resultados da corrida de velocidade. Corrida disputada em 5 voltas ao circuito e com rondas de tiro ao alvo (de pé ou deitado).
definition: Teams mit vier Biathleten mit je zwei Damen und zwei Herren pro Mannschaft, die eine Teilstrecke von 3 Runden mit 7,5 km (Herren) oder 6 km (Damen) abdecken. Es wird zwischen den Runden einmal liegend und einmal stehend auf fünf Ziele geschossen. Es gibt drei Nachladepatronen. Reichen die nicht aus, muss pro Fehlschuss eine Strafrunde gelaufen werden. @de
definition: La partenza è determinata dai risultati dell'inseguimento @it
definition: Poursuite: Le départ est déterminé par les résultats du sprint. Course disputée sur 5 tours de circuit et entrecoupée de séances de tir (debout ou couché). @fr
definition: La largada se determina por los resultados del sprint. Una carrera lleva 5 rondas intercaladas por posiciones de tiro al blanco ( de pie o acostado). @es
definition: The start is determined by the results from the sprint. A race held over five laps with target shooting (standing or prone) @en-gb
note: nessuno @it
in scheme: subjectcode
created: 2000-10-30T12:00:00+00:00
modified: 2010-12-15T17:01:09+00:00
broader: http://cv.iptc.org/newscodes/subjectcode/15009000
broad match: http://cv.iptc.org/newscodes/mediatopic/20000852