Bob a quattro
type: Concept
preferred label: ４人乗り @ja-jp
preferred label: four-man sled @en-gb
preferred label: Viererbob @de
preferred label: trenó de 4 @pt-pt
preferred label: trineo de cuatro @es
preferred label: Bob à quatre @fr
definition: Corrida de trenó com uma equipa de 4 participantes. @pt-pt
definition: race consisting of a team of four competitors @en-gb
definition: Corrida de trenó com uma equipe de 2 participantes. @pt-br
definition: Discesa compiuta da squadre composte di quattro concorrenti
definition: course avec un equipage à quatre concurrents @fr
definition: 4人1組で行われる競技 @ja-jp
definition: Carrera en trineo que consiste en un equipo de cuatro competidores. @es
definition: Rennen mit einem Team aus vier Wettkämpfern. @de
note: nessuno
in scheme: subjectcode
created: 2000-10-30T12:00:00+00:00
modified: 2010-12-15T17:01:09+00:00
broad match: http://cv.iptc.org/newscodes/mediatopic/20000854
broader: http://cv.iptc.org/newscodes/subjectcode/15011000