Medi
type: Concept
preferred label: ミドル級 @ja-jp
preferred label: peso médio @pt-pt
preferred label: Mittelgewicht @de
preferred label: middleweight @en-gb
preferred label: Mi-moyens @fr
preferred label: medio pesado @es
definition: Categoría de peso que varía de acuerdo a la federación. @es
definition: Categoria di peso che varia in base alla federazione
definition: catégorie de poids variant selon les fédérations @fr
definition: Categoria de peso que varia consoante a federação. @pt-pt
definition: Gewichtsklasse im Boxen die je nach Verband variiert. @de
definition: 連盟による様々な体重別のカテゴリー @ja-jp
definition: Weight category in boxing which varies according to the federation @en-gb
note: nessuno
in scheme: subjectcode
created: 2000-10-30T12:00:00+00:00
modified: 2010-12-15T17:01:09+00:00
broad match: http://cv.iptc.org/newscodes/mediatopic/20000856
broader: http://cv.iptc.org/newscodes/subjectcode/15014000