savate
type: Concept
preferred label: boxeo francés @es
preferred label: Französisch Boxen @de
preferred label: Pugilato francese @it
preferred label: フレンチボクシング @ja-jp
preferred label: Boxe française @fr
preferred label: French boxing @en-gb
definition: sport de combat utilisant des mouvements de percussion (coups) qui permettent de frapper avec toutes les surfaces des pieds et le devant des poings @fr
definition: Lotta sportiva nella quale sono permessi calci con ogni parte del piede e pugni con la loro parte frontale @it
definition: 足のすべての部分でキックが許され、かつ、拳の正面でパンチすることも許可される格闘技 @ja-jp
definition: Kampfsportart bei der alle Teile des Fußes treten dürfen und schlagen mit dem vorderen Teil der Fäuste ebenfalls erlaubt ist. @de
definition: Esporte de combate em que é permitido bater com todas as partes dos pés e socar com a parte frontal dos punhos.
definition: Deporte de combate en el cual se permite dar patadas y golpear con la parte frontal del puño. @es
definition: Combat sport in which kicking with all parts of the feet are permitted and punching with the front of the fist is also allowed @en-gb
definition: Desporto de combate em que é permitido bater com todas as partes dos pés e socar com a parte frontal dos punhos.
note: nessuno @it
in scheme: subjectcode
created: 2000-10-30T12:00:00+00:00
modified: 2010-12-15T17:01:09+00:00
broader: http://cv.iptc.org/newscodes/subjectcode/15014000
broad match: http://cv.iptc.org/newscodes/mediatopic/20000856