muay thai
type: Concept
preferred label: Thai Boxen @de
preferred label: Boxe Thai @fr
preferred label: Pugilato thai @it
preferred label: boxeo tailandés @es
preferred label: Thai boxing @en-gb
preferred label: タイ式ボクシング @ja-jp
definition: Forma de boxeo que permite el uso de puños, pies, rodillas, codos y piernas. @es
definition: こぶし、足、ひざ、肘と足の殴打を要するボクシングスタイル @ja-jp
definition: Form of boxing involving punches with fists, feet, knees, elbows and legs. @en-gb
definition: Forma di pugilato in cui è permesso picchiare con pugni, piedi, ginocchia, gomiti e gambe @it
definition: Desporto de combate envolvendo golpes com punhos, pés, joelhos, cotovelos e pernas.
definition: Esporte de combate envolvendo golpes com punhos, pés, joelhos, cotovelos e pernas.
definition: sport de combat qui utilise les frappes avec les poings,les pieds, les tibias, les genoux et le coude @fr
definition: Form des Boxens mit Faustschlägen, Füßen, Knien, Elbögen und Beinen. @de
note: nessuno @it
in scheme: subjectcode
created: 2000-10-30T12:00:00+00:00
modified: 2010-12-15T17:01:09+00:00
broader: http://cv.iptc.org/newscodes/subjectcode/15014000
broad match: http://cv.iptc.org/newscodes/mediatopic/20000856