1000 m
type: Concept
preferred label: １０００ｍ @ja-jp
preferred label: 1000m @fr
definition: 1000mの距離で開催されるレース @ja-jp
definition: Corrida de 1000m.
definition: Rennen über eine Strecke von 1000 m @de
definition: course en ligne sur 1000m @fr
definition: Corsa su 1000 m @it
definition: Carrera sostenida sobre 1000 metros lineales. @es
definition: race held over 1000m @en-gb
note: nessuno @it
in scheme: subjectcode
created: 2000-10-30T12:00:00+00:00
modified: 2010-12-15T17:01:09+00:00
broader: http://cv.iptc.org/newscodes/subjectcode/15015000