K1
type: Concept
preferred label: k1 @es
preferred label: カヤックシングル @ja-jp
definition: Caiaque de 1 lugar (embarcação fechada para uma pessoa sentada em assento fixo que rema com remo de duas pás).
definition: Imbarcazione chiusa ad un posto in cui il concorrente è seduto su un sedile fisso e usa una pagaia @it
definition: Embarcación para una persona sentada en asiento fijo con remo de dos extremos. @es
definition: Kayak une place (bateau fermé et l'athlète pagaie en position assise à l'aide d'une pagaie double) @fr
definition: Ein geschlossenes Boot, worin die Wettkämpfer in festen Sitzen sitzen und ein Doppelpaddel benutzen. @de
definition: an enclosed boat with the competitor sitting on a fixed seat for one person using a double bladed paddle @en-gb
definition: Caiaque de 1 lugar (embarcação fechada para uma pessoa sentada em assento fixo que rema com pagaia dupla).
definition: 1人乗りの座席が固定され囲いがあるボートの競技で一対のパドルを使う @ja-jp
note: nessuno @it
in scheme: subjectcode
created: 2000-10-30T12:00:00+00:00
modified: 2010-12-15T17:01:09+00:00
broader: http://cv.iptc.org/newscodes/subjectcode/15015000
broad match: http://cv.iptc.org/newscodes/mediatopic/20000979