Pontoniering
type: Concept
preferred label: ポントニーリング @ja-jp
preferred label: pontoniering @en-gb
preferred label: none @es
definition: sport militaire utilisant des bateaux similaires aux canoës @fr
definition: Sport di squadra, di tradizione militare, simile alla regata di canoa ma su imbarcazioni @it
definition: Esporte de equipa, de tradição militar, que usa barcos semelhantes às canoas. @pt-br
definition: Desporto de equipa, de tradição militar, que usa barcos semelhantes às canoas. @pt-pt
definition: Deporte colectivo, de tradición militar, similar a la regata de canoas, pero en botes. @es
definition: 団体競技、軍の伝統、カヌー・レガッタに似ている、漕艇に属する @ja-jp
definition: Team sport, military tradition, similar to canoe regatta, in boats @en-gb
definition: Mannschaftssport in militärischer Tradition mit Booten, ähnlich der Kanuregatta.
note: nessuno @it
in scheme: subjectcode
created: 2003-11-26T12:00:00+00:00
modified: 2012-07-10T12:00:00+00:00
broader: http://cv.iptc.org/newscodes/subjectcode/15015000